AuAuH-

Vibrational and/or electronic energy levels

Data compiled by: Marilyn E. Jacox

State:   X

Vib.
sym.
 No.   Approximate
 type of mode
 cm-1   Med.   Method   References

AuH stretch 1991.7 H2 IR Wang, Andrews, et al., 2003

References

Wang, Andrews, et al., 2003
Wang, X.; Andrews, L.; Manceron, L.; Marsden, C., Infrared Spectra and DFT Calculations for the Coinage Metal Hydrides MH, (H, J. Phys. Chem. A, 2003, 107, 41, 8492, https://doi.org/10.1021/jp0354346 . [all data]