AuH2

Vibrational and/or electronic energy levels

Data compiled by: Marilyn E. Jacox

State:   X

Vib.
sym.
 No.   Approximate
 type of mode
 cm-1   Med.   Method   References

a1 2 Bend 638.1 H2 IR Andrews and Wang, 2003
Wang, Andrews, et al., 2003
Andrews, Wang, et al., 2004

References

Andrews and Wang, 2003
Andrews, L.; Wang, X., Infrared Spectra and Structures of the Stable CuH, J. Am. Chem. Soc., 2003, 125, 38, 11751, https://doi.org/10.1021/ja036307q . [all data]

Wang, Andrews, et al., 2003
Wang, X.; Andrews, L.; Manceron, L.; Marsden, C., Infrared Spectra and DFT Calculations for the Coinage Metal Hydrides MH, (H, J. Phys. Chem. A, 2003, 107, 41, 8492, https://doi.org/10.1021/jp0354346 . [all data]

Andrews, Wang, et al., 2004
Andrews, L.; Wang, X.; Manceron, L.; Balasubramanian, K., The Gold Dihydride Molecule, AuH, J. Phys. Chem. A, 2004, 108, 15, 2936, https://doi.org/10.1021/jp036864z . [all data]