As5

Vibrational and/or electronic energy levels

Data compiled by: Marilyn E. Jacox

State:   D

 Energy
 (cm-1
 Med.   Transition   λmin
 (nm)
 λmax
 (nm)

References

Txx = 17510 ± 470 gas Zhai, Wang, et al., 2002

State:   C

 Energy
 (cm-1
 Med.   Transition   λmin
 (nm)
 λmax
 (nm)

Txx = 15730 ± 470 gas Zhai, Wang, et al., 2002

State:   B

 Energy
 (cm-1
 Med.   Transition   λmin
 (nm)
 λmax
 (nm)

Txx = 12340 ± 520 gas Zhai, Wang, et al., 2002

State:   A

 Energy
 (cm-1
 Med.   Transition   λmin
 (nm)
 λmax
 (nm)

Txx = 2985 ± 440 gas Zhai, Wang, et al., 2002

State:   X'

 Energy
 (cm-1
 Med.   Transition   λmin
 (nm)
 λmax
 (nm)

Txx = 1050 ± 440 gas Zhai, Wang, et al., 2002

Zhai, Wang, et al., 2002
Zhai, H.-J.; Wang, L.-S.; Kuznetsov, A.E.; Boldyrev, A.I., Probing the Electronic Structure and Aromaticity of Pentapnictogen Cluster Anions Pn, J. Phys. Chem. A, 2002, 106, 23, 5600, https://doi.org/10.1021/jp020115k . [all data]