Al4Ge-

Vibrational and/or electronic energy levels

Data compiled by: Marilyn E. Jacox

State:   ?

 Energy
 (cm-1
 Med.   Transition   λmin
 (nm)
 λmax
 (nm)

References

Td = 17060 ± 160 gas Boldyrev, Li, et al., 2000

Additional references: Jacox, 2003, page 279

Boldyrev, Li, et al., 2000
Boldyrev, A.I.; Li, X.; Wang, L.-S., Experimental Observation of Pentaatomic Tetracoordinate Planar Si- and Ge-Containing Molecules: MAl4- and MAl4, Angew. Chem. Int. Ed., 2000, 39, 18, 3307, https://doi.org/10.1002/1521-3773(20000915)39:18<3307::AID-ANIE3307>3.0.CO;2-# . [all data]

Jacox, 2003
Jacox, M.E., Vibrational and electronic energy levels of polyatomic transient molecules: supplement B, J. Phys. Chem. Ref. Data, 2003, 32, 1, 1-441, https://doi.org/10.1063/1.1497629 . [all data]