Al3Ge2

Vibrational and/or electronic energy levels

Data compiled by: Marilyn E. Jacox

State:   C

 Energy
 (cm-1
 Med.   Transition   λmin
 (nm)
 λmax
 (nm)

References

Tx = 11700 ± 470 gas Li, Wang, et al., 2002

State:   B

 Energy
 (cm-1
 Med.   Transition   λmin
 (nm)
 λmax
 (nm)

Tx = 8880 ± 400 gas Li, Wang, et al., 2002

State:   A

 Energy
 (cm-1
 Med.   Transition   λmin
 (nm)
 λmax
 (nm)

Tx = 4280 ± 340 gas Li, Wang, et al., 2002

Li, Wang, et al., 2002
Li, X.; Wang, L.-S.; Cannon, N.A.; Boldyrev, A.I., Electronic structure and chemical boning in nonstoichiometric molecules: Al[sub 3]X[sub 2][sup -](X=C,Si,Ge). A photoelectron spectroscopy and ab initio study, J. Chem. Phys., 2002, 116, 4, 1330, https://doi.org/10.1063/1.1429652 . [all data]