Al2H6

Vibrational and/or electronic energy levels

Data compiled by: Marilyn E. Jacox

State:   X

Vib.
sym.
 No.   Approximate
 type of mode
 cm-1   Med.   Method   References

b1u 8 AlHt stretch 1935.0 Ne IR Wang, Andrews, et al., 2003
Andrews and Wang, 2004
8 AlHt stretch 1922.2 Ar IR Wang, Andrews, et al., 2003
8 AlHt stretch 1933.5 p-H2 IR Wang, Andrews, et al., 2003
8 AlHt stretch 1932.3 H2 IR Andrews and Wang, 2003
Wang, Andrews, et al., 2003
Andrews and Wang, 2004
9 Deformation 835.0 Ne IR Wang, Andrews, et al., 2003
Andrews and Wang, 2004
9 Deformation 835.2 p-H2 IR Wang, Andrews, et al., 2003
9 Deformation 835.6 H2 IR Andrews and Wang, 2003
Wang, Andrews, et al., 2003
Andrews and Wang, 2004
b2u 13 AlHb stretch 1259.4 Ne IR Wang, Andrews, et al., 2003
Andrews and Wang, 2004
13 AlHb stretch 1243.4 Ar IR Wang, Andrews, et al., 2003
13 AlHb stretch 1264.3 p-H2 IR Wang, Andrews, et al., 2003
13 AlHb stretch 1268.2 H2 IR Andrews and Wang, 2003
Wang, Andrews, et al., 2003
Andrews and Wang, 2004
14 Deformation 629.6 Ne IR Wang, Andrews, et al., 2003
Andrews and Wang, 2004
14 Deformation 631.9 H2 IR Andrews and Wang, 2003
Wang, Andrews, et al., 2003
Andrews and Wang, 2004
b3u 16 AlHt stretch 1916.6 Ne IR Wang, Andrews, et al., 2003
Andrews and Wang, 2004
16 AlHt stretch 1905.7 Ar IR Wang, Andrews, et al., 2003
16 AlHt stretch 1916.0 p-H2 IR Wang, Andrews, et al., 2003
16 AlHt stretch 1915.1 H2 IR Andrews and Wang, 2003
Wang, Andrews, et al., 2003
Andrews and Wang, 2004
17 AlHb stretch 1404.7 Ne IR Wang, Andrews, et al., 2003
Andrews and Wang, 2004
17 AlHb stretch 1388.0 Ar IR Wang, Andrews, et al., 2003
17 AlHb stretch 1406.1 p-H2 IR Wang, Andrews, et al., 2003
17 AlHb stretch 1408.1 H2 IR Andrews and Wang, 2003
Wang, Andrews, et al., 2003
Andrews and Wang, 2004
18 Deformation 705.3 Ne IR Wang, Andrews, et al., 2003
Andrews and Wang, 2004
18 Deformation 702.4 H2 IR Andrews and Wang, 2003
Wang, Andrews, et al., 2003
Andrews and Wang, 2004

References

Wang, Andrews, et al., 2003
Wang, X.; Andrews, L.; Tam, S.; DeRose, M.E.; Fajardo, M.E., Infrared Spectra of Aluminum Hydrides in Solid Hydrogen: Al, J. Am. Chem. Soc., 2003, 125, 30, 9218, https://doi.org/10.1021/ja0353560 . [all data]

Andrews and Wang, 2004
Andrews, L.; Wang, X., Infrared Spectra of Dialanes in Solid Hydrogen, J. Phys. Chem. A, 2004, 108, 19, 4202, https://doi.org/10.1021/jp037792e . [all data]

Andrews and Wang, 2003
Andrews, L.; Wang, X., The Infrared Spectrum of Al2H6 in Solid Hydrogen, Science, 2003, 299, 5615, 2049, https://doi.org/10.1126/science.1082456 . [all data]