(BrAlO)2

Vibrational and/or electronic energy levels

Data compiled by: Marilyn E. Jacox

State:   X

Vib.
sym.
 No.   Approximate
 type of mode
 cm-1   Med.   Method   References

b1u 4 790.2 Ar IR Bahlo, Himmel, et al., 2002
b2u 7 800.9 Ar IR Bahlo, Himmel, et al., 2002

References

Bahlo, Himmel, et al., 2002
Bahlo, J.; Himmel, H.-J.; Schnockel, H., Photolytic Reactions of Subvalent Aluminum(I) Halides in the Presence of Dioxygen: Generation and Characterization of the Peroxo Species XAlO, Inorg. Chem., 2002, 41, 10, 2678, https://doi.org/10.1021/ic011313d . [all data]