AlI2

Vibrational and/or electronic energy levels

Data compiled by: Marilyn E. Jacox

State:   X

Vib.
sym.
 No.   Approximate
 type of mode
 cm-1   Med.   Method   References

b2 3 Asym. stretch 385.9 Ar IR Hassanzadeh, Citra, et al., 1996

Additional references: Jacox, 1998, page 193

References

Hassanzadeh, Citra, et al., 1996
Hassanzadeh, P.; Citra, A.; Andrews, L.; Neurock, M., Laser-Evaporated Aluminum Atom Reactions with Halogen Molecules. Infrared Spectra of AlX, J. Phys. Chem., 1996, 100, 18, 7317, https://doi.org/10.1021/jp953065a . [all data]

Jacox, 1998
Jacox, M.E., Vibrational and electronic energy levels of polyatomic transient molecules: supplement A, J. Phys. Chem. Ref. Data, 1998, 27, 2, 115-393, https://doi.org/10.1063/1.556017 . [all data]