AlSiH3

Vibrational and/or electronic energy levels

Data compiled by: Marilyn E. Jacox

State:   X

Vib.
sym.
 No.   Approximate
 type of mode
 cm-1   Med.   Method   References

a1 2 Deformation 836.2 Ar IR Gaertner and Himmel, 2002
Gaertner, Himmel, et al., 2004
e 4 SiH3 stretch 2151.3 Ar IR Gaertner and Himmel, 2002
Gaertner, Himmel, et al., 2004

References

Gaertner and Himmel, 2002
Gaertner, B.; Himmel, H.-J., Characterization and Photochemistry of the Silane-Aluminum Complex Al•SiH, Angew. Chem. Int. Ed., 2002, 41, 9, 1538, https://doi.org/10.1002/1521-3773(20020503)41:9<1538::AID-ANIE1538>3.0.CO;2-K . [all data]

Gaertner, Himmel, et al., 2004
Gaertner, B.; Himmel, H.-J.; Macrae, V.A.; Downs, A.J.; Greene, T.M., Matrix Reactivity of Al and Ga Atoms (M) in the Presence of Silane: Generation and Characterization of theη2-Coordinated Complex M•SiH4, the Insertion Product HMSiH3, and the MI Species MSiH3 in a Solid Argon Matrix, Chem. Eur. J., 2004, 10, 14, 3430, https://doi.org/10.1002/chem.200305493 . [all data]