HAlPH2

Vibrational and/or electronic energy levels

Data compiled by: Marilyn E. Jacox

State:   ?

 Energy
 (cm-1
 Med.   Transition   λmin
 (nm)
 λmax
 (nm)

References

Tx = 18180 Ar Himmel, Downs, et al., 2001

State:   X

Vib.
sym.
 No.   Approximate
 type of mode
 cm-1   Med.   Method   References

3 AlH stretch 1768.2 Ar IR Himmel, Downs, et al., 2001
4 PH2 scissors 1159.4 Ar IR Himmel, Downs, et al., 2001
5 PH2 wag 727.1 Ar IR Himmel, Downs, et al., 2001
7 HAlP deform. 403.9 Ar IR Himmel, Downs, et al., 2001

Additional references: Jacox, 2003, page 253

Himmel, Downs, et al., 2001
Himmel, H.-J.; Downs, A.J.; Greene, T.M., Reactions of Aluminum, Gallium, and Indium (M) Atoms with Phosphine: Generation and Characterization of the Species M·PH, Inorg. Chem., 2001, 40, 2, 396, https://doi.org/10.1021/ic000837v . [all data]

Jacox, 2003
Jacox, M.E., Vibrational and electronic energy levels of polyatomic transient molecules: supplement B, J. Phys. Chem. Ref. Data, 2003, 32, 1, 1-441, https://doi.org/10.1063/1.1497629 . [all data]