AlNH3+

Vibrational and/or electronic energy levels

Data compiled by: Marilyn E. Jacox

State:   X

Vib.
sym.
 No.   Approximate
 type of mode
 cm-1   Med.   Method   References

a1 3 AlN stretch 333 gas TPE Yang and Miyawaki, 1999
e 6 Deformation 557 gas TPE Yang and Miyawaki, 1999

Additional references: Jacox, 2003, page 251; Jakubek and Simard, 2000

References

Yang and Miyawaki, 1999
Yang, D.-S.; Miyawaki, J., Zero kinetic energy spectroscopy of AlNH3 complex, Chem. Phys. Lett., 1999, 313, 3-4, 514, https://doi.org/10.1016/S0009-2614(99)01022-2 . [all data]

Jacox, 2003
Jacox, M.E., Vibrational and electronic energy levels of polyatomic transient molecules: supplement B, J. Phys. Chem. Ref. Data, 2003, 32, 1, 1-441, https://doi.org/10.1063/1.1497629 . [all data]

Jakubek and Simard, 2000
Jakubek, Z.J.; Simard, B., The excited electronic states and the ionization potential of the AlND[sub 3] complex, J. Chem. Phys., 2000, 112, 4, 1733, https://doi.org/10.1063/1.480738 . [all data]