F(cyc-AlO2)

Vibrational and/or electronic energy levels

Data compiled by: Marilyn E. Jacox

State:   X

Vib.
sym.
 No.   Approximate
 type of mode
 cm-1   Med.   Method   References

a1 1 OO stretch 1077.3 Ar IR Bahlo, Himmel, et al., 2001
Bahlo, Himmel, et al., 2002
b2 5 AlO2 a-stretch 781.8 Ar IR Bahlo, Himmel, et al., 2001
Bahlo, Himmel, et al., 2002

Additional references: Jacox, 2003, page 232

References

Bahlo, Himmel, et al., 2001
Bahlo, J.; Himmel, H.-J.; Schnockel, H., The First Dectection of Peroxo and Bis-superoxo Complexes of Aluminum: FAlO2 and FAlO4, Angew. Chem. Int. Ed., 2001, 40, 24, 4696, https://doi.org/10.1002/1521-3773(20011217)40:24<4696::AID-ANIE4696>3.0.CO;2-W . [all data]

Bahlo, Himmel, et al., 2002
Bahlo, J.; Himmel, H.-J.; Schnockel, H., Photolytic Reactions of Subvalent Aluminum(I) Halides in the Presence of Dioxygen: Generation and Characterization of the Peroxo Species XAlO, Inorg. Chem., 2002, 41, 10, 2678, https://doi.org/10.1021/ic011313d . [all data]

Jacox, 2003
Jacox, M.E., Vibrational and electronic energy levels of polyatomic transient molecules: supplement B, J. Phys. Chem. Ref. Data, 2003, 32, 1, 1-441, https://doi.org/10.1063/1.1497629 . [all data]