AlF2Cl

Vibrational and/or electronic energy levels

Data compiled by: Marilyn E. Jacox

State:   X

Vib.
sym.
 No.   Approximate
 type of mode
 cm-1   Med.   Method   References

a1 1 AlF2 s-stretch 831.3 Ar IR Himmel, Bahlo, et al., 2002
b2 5 AlF2 a-stretch 887.1 Ar IR Himmel, Bahlo, et al., 2002

References

Himmel, Bahlo, et al., 2002
Himmel, H.-J.; Bahlo, J.; Haussmann, M.; Kurth, F.; Stosser, G.; Schnockel, H., Matrix Reactivity of AlF and AlCl in the Presence of HCl and HBr: Generation and Characterization of the New Al(III) Hydrides HAlFCl, HAlFBr, and HAlClBr and the Monomeric Mixed Al(III) Halides AlX, Inorg. Chem., 2002, 41, 19, 4952, https://doi.org/10.1021/ic020275a . [all data]