AlClBr2

Vibrational and/or electronic energy levels

Data compiled by: Marilyn E. Jacox

State:   X

Vib.
sym.
 No.   Approximate
 type of mode
 cm-1   Med.   Method   References

a1 1 511 Ar IR Pong, Shirk, et al., 1979
Himmel, Bahlo, et al., 2002
3 AlBr2 scissors 104.2 Ar IR Pong, Shirk, et al., 1979
b1 4 OPLA 164.7 Ar IR Pong, Shirk, et al., 1979
b2 5 511 Ar IR Pong, Shirk, et al., 1979
Himmel, Bahlo, et al., 2002
6 Deformation 124.0 Ar IR Pong, Shirk, et al., 1979

References

Pong, Shirk, et al., 1979
Pong, R.G.S.; Shirk, A.E.; Shirk, J.S., Infrared spectra of AlCl2Br, AlClBr2, and AlBr3 in solid argon, J. Chem. Phys., 1979, 70, 1, 525, https://doi.org/10.1063/1.437165 . [all data]

Himmel, Bahlo, et al., 2002
Himmel, H.-J.; Bahlo, J.; Haussmann, M.; Kurth, F.; Stosser, G.; Schnockel, H., Matrix Reactivity of AlF and AlCl in the Presence of HCl and HBr: Generation and Characterization of the New Al(III) Hydrides HAlFCl, HAlFBr, and HAlClBr and the Monomeric Mixed Al(III) Halides AlX, Inorg. Chem., 2002, 41, 19, 4952, https://doi.org/10.1021/ic020275a . [all data]