AgNO-

Vibrational and/or electronic energy levels

Data compiled by: Marilyn E. Jacox

State:   X

Vib.
sym.
 No.   Approximate
 type of mode
 cm-1   Med.   Method   References

1 NO stretch 1399.2 Ne IR Citra and Andrews, 2001
1 NO stretch 1392.3 Ar IR Citra and Andrews, 2001

Additional references: Jacox, 2003, page 102

References

Citra and Andrews, 2001
Citra, A.; Andrews, L., A Spectroscopic and Theoretical Investigation of Charge Transfer Complexes between Silver and Nitric Oxide: Infrared Spectra and Density Functional Calculations of AgNO, J. Phys. Chem. A, 2001, 105, 13, 3042, https://doi.org/10.1021/jp003706o . [all data]

Jacox, 2003
Jacox, M.E., Vibrational and electronic energy levels of polyatomic transient molecules: supplement B, J. Phys. Chem. Ref. Data, 2003, 32, 1, 1-441, https://doi.org/10.1063/1.1497629 . [all data]