6.beta.-Hydroxy-oral turinabol, tri-trimethylsilyl

Van Den Dool and Kratz RI, non-polar column, temperature ramp

View large format table.

Column type Active phase I Reference Comment
CapillaryHP-13018.Schänzer, Horning, et al., 199517. m/0.2 mm/0.11 μm, He, 5. K/min; Tstart: 180. C; Tend: 320. C

References

Schänzer, Horning, et al., 1995
Schänzer, W.; Horning, S.; Donike, M., Metabolism of anabolic steroids in humans: Synthesis of 6β-hydroxy metabolites of 4-chloro-1,2-dehydro-17α -methyltestosterone, fluoxymesterone, and metandienone, Steroids, 1995, 60, 4, 353-366, https://doi.org/10.1016/0039-128X(95)00008-E . [all data]