4-CHLOROPHENOXYACETIC ACID, METHYL,ESTER

Kovats' RI, non-polar column, temperature ramp

View large format table.

Column type Active phase I Reference Comment
CapillaryHP-11510.Staack and Maurer, 200412. m/0.20 mm/0.33 μm, He, 100. C @ 3. min, 30. K/min, 310. C @ 8. min

References

Staack and Maurer, 2004
Staack, R.F.; Maurer, H.H., Studies on the metabolism and the toxicological analysis of the nootropic drug fipexide in rat urine using gas chromatography-mass spectrometry, J. Chromatogr. B, 2004, 804, 2, 337-343, https://doi.org/10.1016/j.jchromb.2004.01.035 . [all data]