6-Cyclohexylnonadecane

Kovats' RI, non-polar column, isothermal

View large format table.

Column type Active phase Temperature (C) I Reference Comment
CapillaryDB-1200.2450.80Stransky and Valterova, 199830. m/0.25 mm/0.25 μm, H2

Kovats' RI, polar column, isothermal

View large format table.

Column type Active phase Temperature (C) I Reference Comment
CapillaryDB-Wax200.2510.65Stransky and Valterova, 199830. m/0.25 mm/0.25 μm, H2

References

Stransky and Valterova, 1998
Stransky, K.; Valterova, I., Gas chromatography and mass spectrometry of isomeric cyclohexylnonadecanes and 1-cyclopentylicosane, Collect. Czech. Chem. Commun., 1998, 63, 10, 1513-1521, https://doi.org/10.1135/cccc19981513 . [all data]