Heptafluorobutyric acid, propyl ester

Kovats' RI, non-polar column, isothermal

View large format table.

Column type Active phase Temperature (C) I Reference Comment
CapillaryOV-101100.642.Promyshlennikova, Kirichenko, et al., 1992
CapillaryOV-101100.642.4Promyshlennikova, Kirichenko, et al., 1991He; Column length: 50. m; Column diameter: 0.25 mm

Van Den Dool and Kratz RI, non-polar column, temperature ramp

View large format table.

Column type Active phase I Reference Comment
Capillary5 % Phenyl methyl siloxane671.Zaikin, 200930. m/0.25 mm/0.25 μm, 15. K/min, 270. C @ 15. min; Tstart: 60. C

References

Promyshlennikova, Kirichenko, et al., 1992
Promyshlennikova, E.P.; Kirichenko, V.E.; Pashkevich, K.I.; Grigor'eva, D.N.; Golovnya, R.V., Influence of the stationary phase nature on the retention of polyfluorinated carboxylic acid esters, Zh. Anal. Khim., 1992, 47, 1070-1075. [all data]

Promyshlennikova, Kirichenko, et al., 1991
Promyshlennikova, E.P.; Kirichenko, V.E.; Pashkevich, K.I.; Grigor'eva, D.N.; Golovnya, R.V., Capillary chromatography of polyfluorinated carboxylic esters, Izv. Akad. Nauk SSSR Ser. Khim., 1991, 8, 1541-1545. [all data]

Zaikin, 2009
Zaikin, V.G., Personal Communication: Retention indices measured during the period 2008 to 2009, 2009. [all data]