2,5,8,11,14,17,20,23,26,29,32,35,38-Tridecaoxatetracontan-40-ol, TMS derivative

Van Den Dool and Kratz RI, non-polar column, custom temperature program

View large format table.

Column type Active phase I Reference Comment
CapillaryVF-5MS4025.2Zheng and White, 200830. m/0.25 mm/0.25 μm, He; Program: not specified

References

Zheng and White, 2008
Zheng, Y.; White, E., Retention Data. NIST Mass Spectrometry Data Center., NIST Mass Spectrometry Data Center, 2008. [all data]