2-[2-[2-[2-[2-[2-[2-(2,2,3,3,3-Pentafluoropropanoyl)oxyethoxy]ethoxy]ethoxy]ethoxy]ethoxy]ethoxy]ethyl 2,2,3,3,3-pentafluoropropanoate

Van Den Dool and Kratz RI, non-polar column, custom temperature program

View large format table.

Column type Active phase I Reference Comment
CapillaryVF-5MS2175.7Zheng and White, 200830. m/0.25 mm/0.25 μm, He; Program: not specified

References

Zheng and White, 2008
Zheng, Y.; White, E., Retention Data. NIST Mass Spectrometry Data Center., NIST Mass Spectrometry Data Center, 2008. [all data]