L-Valine, N-(2,5-difluorobenzoyl)-, heptadecyl ester

Van Den Dool and Kratz RI, non-polar column, custom temperature program

View large format table.

Column type Active phase I Reference Comment
Capillary5 % Phenyl methyl siloxane3319.Zaikin, 2007Column length: 30. m; Column diameter: 0.19 mm; Program: 20C => 5C/min => 120C => 10C/min => 280C

References

Zaikin, 2007
Zaikin, V.G., Personal Communication: Retention indices measured during the period 2006 to 2007 (III), 2007. [all data]