i-Propyl 9-hexadecenoate

Van Den Dool and Kratz RI, non-polar column, temperature ramp

View large format table.

Column type Active phase I Reference Comment
CapillarySE-521998.Casoli, Musini, et al., 199625. m/0.32 mm/0.25 μm, He, 50. C @ 0. min, 25. K/min, 280. C @ 0. min

References

Casoli, Musini, et al., 1996
Casoli, A.; Musini, P.C.; Palla, G., Gas chromatographic-mass spectrometric approach to the problem of characterizing binding media in paintings, J. Chromatogr. A, 1996, 731, 1-2, 237-246, https://doi.org/10.1016/0021-9673(95)01194-3 . [all data]