2-Propylphenol, TMS derivative

Van Den Dool and Kratz RI, non-polar column, temperature ramp

View large format table.

Column type Active phase I Reference Comment
PackedOV-11257.Mattsson and Petersson, 1977N2, Supelcoport, 4. K/min; Column length: 2. m; Tstart: 80. C; Tend: 240. C

Van Den Dool and Kratz RI, non-polar column, custom temperature program

View large format table.

Column type Active phase I Reference Comment
CapillaryVF-5MS1272.5Tret'yakov, 200730. m/0.25 mm/0.25 μm, He; Program: Multi-step temperature program; T(initial)=60C; T(final)=270C

References

Mattsson and Petersson, 1977
Mattsson, M.; Petersson, G., Reference GLC Data for the Analysis of Phenolic Compounds as Trimethylsilyl Derivatives, J. Chromatogr. Sci., 1977, 15, 12, 546-554, https://doi.org/10.1093/chromsci/15.12.546 . [all data]

Tret'yakov, 2007
Tret'yakov, K.V., Retention Data. NIST Mass Spectrometry Data Center., NIST Mass Spectrometry Data Center, 2007. [all data]