2-Ethylphenol, TMS derivative

Van Den Dool and Kratz RI, non-polar column, custom temperature program

View large format table.

Column type Active phase I Reference Comment
CapillaryVF-5MS1204.Tret'yakov, 200730. m/0.25 mm/0.25 μm, He; Program: Multi-step temperature program; T(initial)=60C; T(final)=270C

Normal alkane RI, non-polar column, custom temperature program

View large format table.

Column type Active phase I Reference Comment
CapillarySE-301199.Zimmermann, Lauterbach, et al., 1985Program: not specified

References

Tret'yakov, 2007
Tret'yakov, K.V., Retention Data. NIST Mass Spectrometry Data Center., NIST Mass Spectrometry Data Center, 2007. [all data]

Zimmermann, Lauterbach, et al., 1985
Zimmermann, V.; Lauterbach, M.; Jaeger, G., Analytical characterization phenolic compounds obtained from phenosolvan-extracts by use of gas-chromatography with capillary columns, Chem. Tech. (Leipzig), 1985, 37, 11, 476-478. [all data]