1-(Trihexylsilyloxy)tetradecane

Van Den Dool and Kratz RI, non-polar column, custom temperature program

View large format table.

Column type Active phase I Reference Comment
Capillary5 % Phenyl methyl siloxane3012.Zaikin, 2003Column length: 30. m; Column diameter: 0.19 mm; Program: 50 C to 120 C at 5 C/min; 120 C to 290 C at 12 C/min

Normal alkane RI, non-polar column, custom temperature program

View large format table.

Column type Active phase I Reference Comment
CapillarySE-302970.Poole and Zlatkis, 1979Program: not specified

References

Zaikin, 2003
Zaikin, V.G., Personal Communication: Retention indices measured during the period 2001 to 2003, 2003. [all data]

Poole and Zlatkis, 1979
Poole, C.F.; Zlatkis, A., Trialkylsilyl Ether Derivatives (Other Than TMS) for Gas Chromatography and Mass Spectrometry, J. Chromatogr. Sci., 1979, 17, 3, 115-123, https://doi.org/10.1093/chromsci/17.3.115 . [all data]