18-Norabietane

Kovats' RI, non-polar column, isothermal

View large format table.

Column type Active phase Temperature (C) I Reference Comment
CapillaryOV-1120.1936.Livsey, Douglas, et al., 1984Column length: 30. m; Column diameter: 0.3 mm

References

Livsey, Douglas, et al., 1984
Livsey, A.; Douglas, A.G.; Connan, J., Diterpenoid hydrocarbons in sediments from an offshore (Labrador) well, Org. Geochem., 1984, 6, 73-81, https://doi.org/10.1016/0146-6380(84)90028-7 . [all data]