δ-Neoclovene

Van Den Dool and Kratz RI, non-polar column, custom temperature program

View large format table.

Column type Active phase I Reference Comment
CapillaryCP-Sil5 CB MS1406.2Helmig, Bocquet, et al., 200460. m/0.32 mm/0.25 μm, He; Program: 40C(1min) => 25C/min => 120C => 2C/min => 190C => 25C/min => 250C (5min)
CapillaryDB-11370.9Helmig, Bocquet, et al., 200430. m/0.32 mm/0.1 μm, He; Program: 40C(5min) => 20C/min => 100C => 2C/min => 160C => 40C/min => 250C (5min)
CapillaryDB-11389.6Helmig, Bocquet, et al., 200430. m/0.32 mm/0.25 μm, He; Program: 40C(5min) => 20C/min => 100C => 2C/min => 160C => 40C/min => 250C (5min)

References

Helmig, Bocquet, et al., 2004
Helmig, D.; Bocquet, F.; Pollmann, J.; Revermann, T., Analytical techniques for sesquiterpene emission rate studies in vegetation enclosure experiments, Atmos. Environ., 2004, 38, 4, 557-572, https://doi.org/10.1016/j.atmosenv.2003.10.012 . [all data]