Silane, tributyl methyl

Kovats' RI, non-polar column, isothermal

View large format table.

Column type Active phase Temperature (C) I Reference Comment
CapillaryApiezon L160.1264.Peetre and Smith, 1974

Normal alkane RI, non-polar column, isothermal

View large format table.

Column type Active phase Temperature (C) I Reference Comment
PackedApieson M160.1264.Ellren, Peetre, et al., 1974Chromosorb G AW DMCS (80-100 mesh)

References

Peetre and Smith, 1974
Peetre, I.-B.; Smith, B.E.F., Gas chromatographic investigation of organometallic compounds and their carbon analogues. IV. determination, calculation and correlation of Kováts retention indices for tetraalkylsilanes, J. Chromatogr., 1974, 90, 1, 41-55, https://doi.org/10.1016/S0021-9673(01)94772-7 . [all data]

Ellren, Peetre, et al., 1974
Ellren, O.; Peetre, I.B.; Smith, B.E.F., Gas chromatographic investigation of organometallic compounds and their carbon analogues. V. Use of refractive index in conjunction with Kovats retention index for the identification of organosilicon compounds, J. Chromatogr., 1974, 93, 2, 383-392, https://doi.org/10.1016/S0021-9673(01)85402-9 . [all data]