MELATONIN 2TMS

Van Den Dool and Kratz RI, non-polar column, temperature ramp

View large format table.

Column type Active phase I Reference Comment
CapillaryDB-5MS2378.Umeå Plant Science Centre, 200615. m/0.18 mm/0.18 μm, 70. C @ 2. min, 40. K/min, 320. C @ 1. min
PackedOV-12364.Butts, 1972He, Chromosorb W HP (80-100 mesh), 10. K/min; Column length: 2. m; Tstart: 100. C; Tend: 325. C

References

Umeå Plant Science Centre, 2006
Umeå Plant Science Centre, The Metabolomics facility, RTI data. Compound identification, 2006, retrieved from http://www.upsc.se/metabolomics.htm. [all data]

Butts, 1972
Butts, W.C., Two-Column Gas Chromatography of Trimethylsilyl Derivatives of Biochemically Significant Compounds, Anal. Biochemistry, 1972, 46, 1, 187-199, https://doi.org/10.1016/0003-2697(72)90411-3 . [all data]