2-propoxy-3-chloro-tetrahydro-furan

Kovats' RI, non-polar column, isothermal

View large format table.

Column type Active phase Temperature (C) I Reference Comment
PackedSilicon High Vacuum Grease (obsolete)170.1070.Jonas, Janák, et al., 1966H2
PackedSilicon High Vacuum Grease (obsolete)170.1070.Janák, Jonas, et al., 1965H2, Celite

References

Jonas, Janák, et al., 1966
Jonas, J.; Janák, J.; Kratochvíl, M., Structural investigations with the aid of Kovats retention index system on one (nonpolar) stationary phase, J. Gas Chromatogr., 1966, 4, 9, 332-335, https://doi.org/10.1093/chromsci/4.9.332 . [all data]

Janák, Jonas, et al., 1965
Janák, J.; Jonas, J.; Kratochvíl, M., Identification of some acetals of the tetrahydrofurane sereis by gas chromatography with the aid of the Kováts indices, Collect. Czech. Chem. Commun., 1965, 30, 1, 265-276, https://doi.org/10.1135/cccc19650265 . [all data]