Ethanal, 2-(4-hydroxy-2,6-dimethoxyphenyl)

Normal alkane RI, non-polar column, temperature ramp

View large format table.

Column type Active phase I Reference Comment
CapillaryDB-11642.Kjällstrand, Ramnäs, et al., 199830. m/0.25 mm/0.25 μm, He, 5. K/min; Tstart: 50. C; Tend: 200. C

References

Kjällstrand, Ramnäs, et al., 1998
Kjällstrand, J.; Ramnäs, O.; Petersson, G., Gas chromatographic and mass spectrometric analysis of 36 lignin-related methoxyphenols from uncontrolled combustion of wood, J. Chromatogr. A, 1998, 824, 2, 205-210, https://doi.org/10.1016/S0021-9673(98)00698-0 . [all data]