(E)-3-Decenyl acetate

Kovats' RI, non-polar column, temperature ramp

View large format table.

Column type Active phase I Reference Comment
CapillaryDB-11376.Takeoka, Buttery, et al., 199260. m/0.32 mm/0.25 μm, He, 30. C @ 4. min, 2. K/min; Tend: 210. C

Normal alkane RI, non-polar column, temperature ramp

View large format table.

Column type Active phase I Reference Comment
CapillaryZB-51389.Alagarmalai, Nestel, et al., 200930. m/0.25 mm/0.25 μm, Helium, 60. C @ 2. min, 10. K/min, 230. C @ 10. min

References

Takeoka, Buttery, et al., 1992
Takeoka, G.R.; Buttery, R.G.; Flath, R.A., Volatile constituents of Asian pear (Pyrus serotina), J. Agric. Food Chem., 1992, 40, 10, 1925-1929, https://doi.org/10.1021/jf00022a040 . [all data]

Alagarmalai, Nestel, et al., 2009
Alagarmalai, J.; Nestel, D.; Dragusgich, D.; Nemny-Lavy, E.; Anshelevich, L.; Zada, A.; Soroker, V., Identification of host attactants for the Ethiopian fruit fly, Dacus ciliatus Loew, J. Chem. Ecol., 2009, 35, 5, 542-551, https://doi.org/10.1007/s10886-009-9636-2 . [all data]