3-Buten-2-one, 2,4,6-trichlorophenyl hydrazone

Kovats' RI, non-polar column, custom temperature program

View large format table.

Column type Active phase I Reference Comment
CapillaryHP-51819.Lehmpuhl and Birks, 1996Program: not specified

References

Lehmpuhl and Birks, 1996
Lehmpuhl, D.W.; Birks, J.W., New gas chromatographic-electron-capture detection method for the determination of atmospheric aldehydes and ketones based on cartridge sampling and derivatization with 2,4,6-trichlorophenylhydrazine, J. Chromatogr. A, 1996, 740, 1, 71-81, https://doi.org/10.1016/0021-9673(96)00109-4 . [all data]