2-Propyl-1,3-oxothiolane

Kovats' RI, non-polar column, isothermal

View large format table.

Column type Active phase Temperature (C) I Reference Comment
CapillaryOV-101130.1019.Misharina and Golovnya, 1994He; Column length: 50. m; Column diameter: 0.32 mm
CapillaryOV-101150.1024.Misharina and Golovnya, 1994He; Column length: 50. m; Column diameter: 0.32 mm
CapillarySE-52130.1046.Misharina and Golovnya, 199460. m/0.32 mm/2. μm, He
CapillarySE-52150.1059.Misharina and Golovnya, 199460. m/0.32 mm/2. μm, He
CapillaryOV-101130.1019.Misharina, Golovnya, et al., 199350. m/0.32 mm/0.5 μm, He

Van Den Dool and Kratz RI, non-polar column, temperature ramp

View large format table.

Column type Active phase I Reference Comment
CapillaryOV-1011005.Misharina and Golovnya, 1994He, 50. C @ 0. min, 4. K/min; Column length: 50. m; Column diameter: 0.32 mm; Tend: 200. C
CapillarySE-521040.Misharina and Golovnya, 199460. m/0.32 mm/2. μm, He, 50. C @ 0. min, 4. K/min; Tend: 200. C

References

Misharina and Golovnya, 1994
Misharina, T.A.; Golovnya, R.V., Spectral and gas-chromatographic characterization of 4-methyl-2-alkyl substituted 1,3-oxothiolanes and 1,3-dithiolanes, Zh. Anal. Khim., 1994, 49, 4, 395-401. [all data]

Misharina, Golovnya, et al., 1993
Misharina, T.A.; Golovnya, R.V.; Beletsky, I.V., Sorption properties of heterocyclic compounds differing by heteroatom in capillary gas chromatography, Russ. Chem. Bull. (Engl. Transl.), 1993, 42, 7, 1167-1170, https://doi.org/10.1007/BF00701998 . [all data]