2(1H)-Naphthalenone, 6-methoxy

Kovats' RI, non-polar column, isothermal

View large format table.

Column type Active phase Temperature (C) I Reference Comment
PackedApiezon L170.1711.Arruda, Heinzen, et al., 1993N2, Chromosorb W; Column length: 1.8 m

References

Arruda, Heinzen, et al., 1993
Arruda, A.C.; Heinzen, V.E.F.; Yunes, R.A., Relationship between Kovats retention indices and molecular connectivity indices of tetralones, coumarins and structurally related compounds, J. Chromatogr., 1993, 630, 1-2, 251-256, https://doi.org/10.1016/0021-9673(93)80461-G . [all data]