4-Quinazolone, 2-methyl-3-propyl

Kovats' RI, non-polar column, isothermal

View large format table.

Column type Active phase Temperature (C) I Reference Comment
PackedOV-1220.1826.Papp, Szász, et al., 1991

References

Papp, Szász, et al., 1991
Papp, O.; Szász, Gy.; Orfi, L.; Hermecz, I., Correlation between structure and gas chromatographic behaviour of nitrogen-containing heterocyclic compounds. II. Alkyl substitution of quinazolone derivatives, J. Chromatogr., 1991, 537, 371-376, https://doi.org/10.1016/S0021-9673(01)88910-X . [all data]