Thiazole, 2-ethyl-4-methyl-5-propyl

Kovats' RI, non-polar column, isothermal

View large format table.

Column type Active phase Temperature (C) I Reference Comment
CapillaryOV-101110.1233.Golovnya, Shenderyuk, et al., 1991He; Column length: 50. m; Column diameter: 0.30 mm
CapillaryOV-101110.1233.Zhuravleva, Shenderyuk, et al., 199050. m/0.30 mm/0.40 μm, He

Kovats' RI, polar column, isothermal

View large format table.

Column type Active phase Temperature (C) I Reference Comment
CapillaryPEG-40M110.1567.Golovnya, Shenderyuk, et al., 1991He; Column length: 50. m; Column diameter: 0.30 mm
CapillaryPEG-40M110.1567.Zhuravleva, Shenderyuk, et al., 199050. m/0.30 mm/0.40 μm, He

Normal alkane RI, non-polar column, isothermal

View large format table.

Column type Active phase Temperature (C) I Reference Comment
PackedApieson L100.1224.Golovnya, Zhuravleva, et al., 1987Argon, Chromosorb G AW (80-100 mesh); Column length: 2.4 m

References

Golovnya, Shenderyuk, et al., 1991
Golovnya, R.V.; Shenderyuk, V.V.; Zhuravleva, I.L.; Yakush, E.V., Analogy of sorption properties of alkylthiazoles and alkyl-oxazoles and its use for the calculation of retention indexes in capillary gas chromatography, Zh. Anal. Khim., 1991, 46, 2, 313-319. [all data]

Zhuravleva, Shenderyuk, et al., 1990
Zhuravleva, I.L.; Shenderyuk, V.V.; Yakush, E.V.; Golovnya, R.V., Calculation of retention indexes of alkyloxazoles and alkylthiazoles in capillary chromatography, Bull. Acad. Sci. USSR, Div. Chem. Sci. (Engl. Transl.), 1990, 6, 6, 1204-1210, https://doi.org/10.1007/BF00962384 . [all data]

Golovnya, Zhuravleva, et al., 1987
Golovnya, R.V.; Zhuravleva, I.L.; Yakush, E.V., Calculation of the thermidynamic values of alkylthiazoles from the Kovats retention indices on the basis on the non-linear additivity principle, Chromatographia, 1987, 23, 8, 595-598, https://doi.org/10.1007/BF02324871 . [all data]