Mandelic acid, 2-hydroxy, DCTFA-acetate

Normal alkane RI, non-polar column, temperature ramp

View large format table.

Column type Active phase I Reference Comment
CapillaryBP-11655.Midgley, Andrew, et al., 199010. K/min; Column length: 12. m; Column diameter: 0.25 mm; Tstart: 60. C

References

Midgley, Andrew, et al., 1990
Midgley, J.M.; Andrew, R.; Watson, D.G.; MacDonald, N.; Reid, J.L.; Williams, D.A., Dichlorotetrafluoroacetone as a derivatisation reagent in the analysis of mandelic acids in human urine, J. Chromatogr., 1990, 527, 259-265, https://doi.org/10.1016/S0378-4347(00)82110-6 . [all data]