2-Methyl-2-butenyl (E)-caffeate, bis-TMS

Van Den Dool and Kratz RI, non-polar column, temperature ramp

View large format table.

Column type Active phase I Reference Comment
CapillaryMethyl Silicone2383.Greenaway and Whatley, 199125. m/0.32 mm/0.50 μm, He, 3. K/min; Tstart: 75. C; Tend: 310. C
CapillaryMethyl Silicone2390.Greenaway and Whatley, 199025. m/0.32 mm/0.5 μm, He, 3. K/min; Tstart: 75. C; Tend: 300. C

References

Greenaway and Whatley, 1991
Greenaway, W.; Whatley, F.R., Synthesis of esters of acetyloxycaffeic acids and their occurrence in poplar bud exudates, J. Chromatogr., 1991, 543, 113-121, https://doi.org/10.1016/S0021-9673(01)95759-0 . [all data]

Greenaway and Whatley, 1990
Greenaway, W.; Whatley, F.R., Resolution of complex mixtures of phenolics in poplar bud exudate by analysis of gas chromatography-mass spectrometry data, J. Chromatogr., 1990, 519, 1, 145-158, https://doi.org/10.1016/0021-9673(90)85143-J . [all data]