Retinyl butanoate

Kovats' RI, non-polar column, isothermal

View large format table.

Column type Active phase Temperature (C) I Reference Comment
CapillaryDB-1190.2738.Furr, Clifford, et al., 19925. m/0.25 mm/0.1 μm, H2, He
CapillaryDB-1190.2738.Furr, Zeng, et al., 19905. m/0.25 mm/0.1 μm

References

Furr, Clifford, et al., 1992
Furr, H.C.; Clifford, A.J.; Jones, A.D., Analysis of apocarotenoids and retinoids by capillary gas chromatography - mass spectrometry, Methods Enzymol., 1992, 213, 281-290. [all data]

Furr, Zeng, et al., 1990
Furr, H.C.; Zeng, S.; Clifford, A.J.; Olson, J.A., Capillary gas chromatography of retinoids (vitamin A compounds) and apo-retinoids: determination of Kováts retention indices, J. Chromatogr., 1990, 527, 406-413, https://doi.org/10.1016/S0378-4347(00)82124-6 . [all data]