m-Synephrine, DTFMB-TBDMS

Normal alkane RI, non-polar column, temperature ramp

View large format table.

Column type Active phase I Reference Comment
CapillaryHP-12615.Shafi, Midgley, et al., 1989He, 100. C @ 1. min, 10. K/min; Column length: 12.5 m; Column diameter: 0.20 mm; Tend: 300. C

References

Shafi, Midgley, et al., 1989
Shafi, N.; Midgley, J.M.; Watson, D.G.; Smail, G.A.; Strang, R.; MacFarlane, R.G., Analysis of biogenic amines in the brain of the American Cockroach (Periplaneta Americana) by gas chromatography-negative ion chemical ionisation mass spectrometry, J. Chromatogr., 1989, 490, 9-19, https://doi.org/10.1016/S0378-4347(00)82756-5 . [all data]