(Z,Z)-Farnesyl caprate

Van Den Dool and Kratz RI, polar column, temperature ramp

View large format table.

Column type Active phase I Reference Comment
CapillaryZB-FFAP2801.Lee, Finckbeiner, et al., 200730. m/0.25 mm/0.25 μm, He, 2.5 K/min; Tstart: 100. C; Tend: 250. C

References

Lee, Finckbeiner, et al., 2007
Lee, H.; Finckbeiner, S.; Yu, J.S.; Wiemer, D.F.; Eisner, T.; Attygalle, A.B., Characterization of (E,E)-farnesol and its fatty acid esters from anal scent glands of nutria (Myocastor coypus) by gas chromatography-mass spectrometry and gas chromatography-infrared spectrometry, J. Chromatogr. A, 2007, 1165, 1-2, 136-143, https://doi.org/10.1016/j.chroma.2007.06.041 . [all data]