Dihydrochalcone, 2',4',6'-trihydroxy, TMS

Van Den Dool and Kratz RI, non-polar column, temperature ramp

View large format table.

Column type Active phase I Reference Comment
CapillaryMethyl Silicone2438.Greenaway and Whatley, 199025. m/0.32 mm/0.5 μm, He, 3. K/min; Tstart: 75. C; Tend: 300. C

Van Den Dool and Kratz RI, non-polar column, custom temperature program

View large format table.

Column type Active phase I Reference Comment
CapillaryMethyl Silicone2441.Greenaway, May, et al., 1989Program: not specified

References

Greenaway and Whatley, 1990
Greenaway, W.; Whatley, F.R., Resolution of complex mixtures of phenolics in poplar bud exudate by analysis of gas chromatography-mass spectrometry data, J. Chromatogr., 1990, 519, 1, 145-158, https://doi.org/10.1016/0021-9673(90)85143-J . [all data]

Greenaway, May, et al., 1989
Greenaway, W.; May, J.; Whatley, F.R., Flavonoid aglycones identified by gas chromatography-mass spectrometry in bud exudate of Populus balsamifera, J. Chromatogr., 1989, 472, 393-400, https://doi.org/10.1016/S0021-9673(00)94139-6 . [all data]