(3Z),(2'E)-3-but-2'-enylidene-4,5,6,7-tetrahydrophthalide

Normal alkane RI, non-polar column, temperature ramp

View large format table.

Column type Active phase I Reference Comment
CapillaryCP Sil 5 CB1804.Tesso, Kubeczka, et al., 20063. K/min; Column length: 25. m; Column diameter: 0.25 mm; Tstart: 50. C; Tend: 230. C

References

Tesso, Kubeczka, et al., 2006
Tesso, H.; Kubeczka, K.-H.; König, W.A., A new phthalide from the essential oil of Meum athamanticum, Flavour Fragr. J., 2006, 21, 4, 622-625, https://doi.org/10.1002/ffj.1629 . [all data]