Betaxolol, TBDMS

Van Den Dool and Kratz RI, non-polar column, temperature ramp

View large format table.

Column type Active phase I Reference Comment
CapillaryDB-5MS2600.Paik, Nguyen, et al., 200615. m/0.25 mm/0.25 μm, He, 100. C @ 1. min, 10. K/min, 290. C @ 10. min

References

Paik, Nguyen, et al., 2006
Paik, M.-J.; Nguyen, D.T.; Kim, K.-R., GC and MS Properties of b-Blockers as tert-Butyldimethylsilyl Derivatives and as Ethoxycarbonyl/Trimethylsilyl Derivatives, Chromatographia, 2006, 64, 11-12, 673-679, https://doi.org/10.1365/s10337-006-0095-4 . [all data]