4-Methyl-4-decanolide

Van Den Dool and Kratz RI, non-polar column, temperature ramp

View large format table.

Column type Active phase I Reference Comment
CapillarySPB-11450.Näf and Jaquier, 200630. m/0.25 mm/1. μm, He, 60. C @ 5. min, 5. K/min; Tend: 250. C

Normal alkane RI, polar column, temperature ramp

View large format table.

Column type Active phase I Reference Comment
CapillarySupelcowax2060.Näf and Jaquier, 200630. m/0.25 mm/0.25 μm, He, 50. C @ 5. min, 5. K/min; Tend: 240. C

References

Näf and Jaquier, 2006
Näf, R.; Jaquier, A., New lactones in liquorice (Glycyrrhiza glabra L.), Flavour Fragr. J., 2006, 21, 2, 193-197, https://doi.org/10.1002/ffj.1576 . [all data]