p-Menth-2-ene, 1,4-epoxy

Normal alkane RI, non-polar column, temperature ramp

View large format table.

Column type Active phase I Reference Comment
CapillaryCP Sil 5 CB1220.Kasali, Ekundayo, et al., 20063. K/min; Column length: 25. m; Column diameter: 0.25 mm; Tstart: 50. C; Tend: 230. C

References

Kasali, Ekundayo, et al., 2006
Kasali, A.A.; Ekundayo, O.; Paul, C.; Konig, W.A.; Eshilokun, A.O.; Ige, B., 1,2 : 3,4-Diepoxy-p-menthane and 1,4-epoxy-p-menth-2-ene: Rare monoterpenoids from the essential oil of Chenopodium ambrosioides L. var ambrosioides leaves, J. Essent. Oil Res., 2006, 18, 1, 13-15, https://doi.org/10.1080/10412905.2006.9699372 . [all data]