9,10-epoxy-18-hydroxyoctadec-12-enoic acid, TMSi ester TMSi ether

Normal alkane RI, non-polar column, custom temperature program

View large format table.

Column type Active phase I Reference Comment
CapillaryEC-12808.Kallio, Nieminen, et al., 200630. m/0.25 mm/0.25 μm, He; Program: 125C => 10C/min => 205C => 5C/min => 290C (10min)

References

Kallio, Nieminen, et al., 2006
Kallio, H.; Nieminen, R.; Tuomasjukka, S.; Hakala, M., Cutin composition of five Finnish berries, J. Agric. Food Chem., 2006, 54, 2, 457-462, https://doi.org/10.1021/jf0522659 . [all data]