3-Hexyl 3,14-dimethylpentadecanoate

Van Den Dool and Kratz RI, non-polar column, custom temperature program

View large format table.

Column type Active phase I Reference Comment
CapillaryDB-52279.Gries R., Khaskin G., et al., 200630. m/0.32 mm/0.25 μm; Program: not specified

References

Gries R., Khaskin G., et al., 2006
Gries R.; Khaskin G.; Tan Z.X.; Zhao B.G.; King G.G.S.; Miroshnychenko A.; Lin G.Q.; Rhainds M.; Gries G., (1S)-1-ethyl-2-methylpropyl 3,13-dimethylpentadecanoate: Major sex pheromone component of Paulownia bagworm, Clania variegata, J. Chem. Ecol., 2006, 32, 8, 1673-1685, https://doi.org/10.1007/s10886-006-9101-4 . [all data]